BDBM50495307 CHEMBL3103545
SMILES COc1ccc(CCC(=O)c2ccc3OC(C)(C)C(O)Cc3c2O)cc1
InChI Key InChIKey=SXUATLUQEIRYSG-UHFFFAOYSA-N
Data  2 KI  2 IC50
  Tab Delimited (TSV)   2D SDfile   Computed 3D by Vconf -m prep SDfile
Find this compound or compounds like it in BindingDB:
Activity Spreadsheet -- Enzyme Inhibition Constant Data from BindingDB
Found 4 hits for monomerid = 50495307
TargetPolyphenol oxidase 2(Agaricus bisporus (Common mushroom))
Gyeongsang National University
Curated by ChEMBL
LigandPNGBDBM50495307(CHEMBL3103545)
Affinity DataKi:  9.36E+3nM. Assay description: Competitive inhibition of mushroom tyrosinase using L-tyrosine as substrate preincubated for 10 mins with substrate followed by enzyme addition measu...
Ligand InfoPC cidPC sid
In DepthDetails ArticlePubMed
TargetPolyphenol oxidase 2(Agaricus bisporus (Common mushroom))
Gyeongsang National University
Curated by ChEMBL
LigandPNGBDBM50495307(CHEMBL3103545)
Affinity DataKi:  1.33E+4nM. Assay description: Competitive inhibition of mushroom tyrosinase using L-DOPA as substrate preincubated for 10 mins with substrate followed by enzyme addition measured ...
Ligand InfoPC cidPC sid
In DepthDetails ArticlePubMed
TargetPolyphenol oxidase 2(Agaricus bisporus (Common mushroom))
Gyeongsang National University
Curated by ChEMBL
LigandPNGBDBM50495307(CHEMBL3103545)
Affinity DataIC50:  1.84E+4nM. Assay description: Inhibition of mushroom tyrosinase using L-tyrosine as substrate preincubated for 10 mins with substrate followed by enzyme addition measured after 15...
Ligand InfoPC cidPC sid
In DepthDetails ArticlePubMed
TargetPolyphenol oxidase 2(Agaricus bisporus (Common mushroom))
Gyeongsang National University
Curated by ChEMBL
LigandPNGBDBM50495307(CHEMBL3103545)
Affinity DataIC50:  3.26E+4nM. Assay description: Inhibition of mushroom tyrosinase using L-DOPA as substrate preincubated for 10 mins with substrate followed by enzyme addition measured after 15 min...
Ligand InfoPC cidPC sid
In DepthDetails ArticlePubMed